{"text_format":"1","workbook":"xlsx","n_sheets":3,"sheets":["Gastos","Ingreso de Datos","Proyeccion Cuotas"],"not_rendered":{"charts":0,"images":3,"macros":1,"external_links":0,"defined_names":0,"comments":0,"pivot_tables":0},"unopened":[],"bounds":{"document_bytes":16777216,"sheet_cells":100000,"rows_first":2000,"rows_last":500,"rows_between":2000,"halvings":0,"cell_chars":16384,"cell_head_chars":4096},"cells_cut":0,"cells_raw":0,"read":"whole","date_system":"1900"}

{"sheet":"Gastos","index":0,"n_rows":23,"n_cols":9,"rows_kept":23,"cut":false,"hidden":false,"merged":[[11,2,11,3],[11,4,11,5],[11,6,11,7],[21,2,21,6],[22,2,22,6],[20,7,20,8],[21,7,21,8],[22,7,22,8],[20,2,20,6],[19,7,19,8],[19,2,19,6],[18,2,18,6],[16,2,16,8],[17,2,17,6],[17,7,17,8],[18,7,18,8],[9,2,9,3],[9,4,9,5],[9,6,9,7],[10,2,10,3],[10,4,10,5],[10,6,10,7],[4,2,4,8],[5,2,5,3],[5,4,5,5],[5,6,5,7],[12,2,12,3],[12,4,12,5],[12,6,12,7],[6,2,6,3],[6,4,6,5],[6,6,6,7],[7,2,7,3],[7,4,7,5],[7,6,7,7],[8,2,8,3],[8,4,8,5],[8,6,8,7],[13,2,13,3],[13,4,13,5],[13,6,13,7],[14,2,14,3],[14,4,14,5],[14,6,14,7]]}
[]
[]
[{"$f":"+H18","v":100000}]
[{"$f":"+SUM(A6:A15)","v":6}]
[null,null,"Rangos de Gastos de Legalizacion"]
[{"$f":"+I6","v":0},null,1000,null,5000,null,250,null,{"$f":"IF($A$3>=C6,IF($A$3<=E6,1,0),0)","v":0}]
[0,null,5001,null,15000,null,250,null,{"$f":"IF($A$3>=C7,IF($A$3<=E7,2,0),0)","v":0}]
[0,null,15001,null,30000,null,250,null,{"$f":"IF($A$3>=C8,IF($A$3<=E8,3,0),0)","v":0}]
[0,null,30001,null,50000,null,350,null,{"$f":"IF($A$3>=C9,IF($A$3<=E9,4,0),0)","v":0}]
[0,null,50001,null,80000,null,500,null,{"$f":"IF(AND($A$3>C10,$A$3<=E10),5,0)","v":0}]
[6,null,80001,null,120000,null,750,null,{"$f":"IF(AND($A$3>C11,$A$3<=E11),6,0)","v":6}]
[0,null,120001,null,180000,null,1000,null,{"$f":"IF(AND($A$3>C12,$A$3<=E12),7,0)","v":0}]
[0,null,180001,null,250000,null,1500,null,{"$f":"IF(AND($A$3>C13,$A$3<=E13),7,0)","v":0}]
[0,null,250001,null,400000,null,2150,null,{"$f":"IF(AND($A$3>C14,$A$3<=E14),7,0)","v":0}]
[0,null,400001,null,600000,null,2650,null,{"$f":"IF(AND($A$3>C15,$A$3<=E15),7,0)","v":0}]
[]
[null,null,"Gastos Prestamo"]
[null,null,"Monto Solicitado",null,null,null,null,{"$f":"+'Ingreso de Datos'!D5","v":100000}]
[null,null,"Comision por Desembolso",null,null,null,null,{"$f":"+IF($A$3=0,0,100)","v":100}]
[null,null,"Gastos de Legalizacion",null,null,null,null,{"$f":"IF(A3=0,0,VLOOKUP($A$4,$A$6:$H$15,7,FALSE))","v":750}]
[null,null,"Intereses Anticipados",null,null,null,null,{"$f":"+'Proyeccion Cuotas'!J16","v":544.65753424657532}]
[null,null,"Seguro por Desempleo (Cubre el Ier.  año)",null,null,null,null,{"$f":"IF($A$3<=50000,IF('Proyeccion Cuotas'!$F$3>=24,($A$3*1.25%),0),0)","v":0}]
[null,null,"Total de Gastos",null,null,null,null,{"$f":"SUM(H19:H22)","v":1394.6575342465753}]

{"sheet":"Ingreso de Datos","index":1,"n_rows":69,"n_cols":13,"rows_kept":69,"cut":false,"hidden":false,"merged":[[31,2,31,7],[16,5,16,6],[4,5,4,6],[59,5,59,7],[54,2,54,3],[45,2,45,3],[47,2,47,3],[49,2,49,3],[51,2,51,3],[6,5,6,6],[10,5,10,6],[12,5,12,6],[20,5,20,6],[26,3,27,3],[26,5,27,5]]}
[null,null,null,null,null,null,null,null,null,null,null,{"$f":"+IF(OR(D5=\"\",D7=\"\",D13=\"\",D17=\"\",D19=\"\",D21=\"\"),1,2)","v":2}]
[null,null,null,null,null,null,null,null,null,null,null,"Fingreso",{"$f":"+D17","v":"2020-12-17"}]
[null,null,"Completa la información que te indican las flechas",null,null,null,"FechaDesem",null,null,null,null,"Fhoy",{"$f":"+TODAY()","v":"2025-01-03"}]
[null,null,null,null,null,null,null,null,null,null,null,null,{"$f":"+M3-M2","v":1478}]
[null,null,"Monto a solicitar",100000,null,{"$f":"+IF(D5=\"\",\"* Campo Obligatorio\",\"\")","v":""},null,null,null,null,null,"Estabilidad",{"$f":"+M4/365","v":4.0493150684931507}]
[]
[null,null,"Plazo (en meses)",36,null,{"$f":"+IF(D7=\"\",\"* Campo Obligatorio\",\"\")","v":""},null,null,null,null,null,null,{"$f":"+M5/12","v":0.33744292237442924}]
[]
[null,null,"Plazo en años",{"$f":"+IF(D7=\"\",\"\",D7/12)","v":3}]
[]
[null,null,"Tasa de interes",7.0999999999999994E-2]
[]
[null,null,"Aporte extraordinario",10000,null,{"$f":"+IF(D13=\"\",\"* Campo Obligatorio\",\"\")","v":""}]
[]
[null,null,"Total de aportes",{"$f":"+D13*2","v":20000}]
[]
[null,null,"Fecha de Ingreso a la corporación","2020-12-17",null,{"$f":"+IF(D17=\"\",\"* Campo Obligatorio\",\"\")","v":""}]
[]
[null,null,"Estabilidad laboral",{"$f":"IF(D17=\"\",\"\",M5)","v":4.0493150684931507}]
[]
[null,null,"Salario Actual",10000,null,{"$f":"+IF(D21=\"\",\"* Campo Obligatorio\",\"\")","v":""}]
[]
[null,null,"Endeudamiento %",{"$f":"+IFERROR(($F$46/$D$21),\"Completar Datos\")","v":0.16557686453576861},null,{"$f":"+IF(D23=\"Completar Datos\",\"\",IF(D23<=0.35,\"Rango Aceptable\",\"Endeudamiento Alto\"))","v":"Rango Aceptable"}]
[]
[null,null,"Recuerda que tu endeudamiento no debe superar el 30%"]
[]
[null,null,null,{"$f":"+IFERROR(ROUNDUP((F46*2.85714285714286),0),\"Completar Datos\")","v":4731},null,"Salario minimo para optar al monto de su interes"]
[]
[]
[]
{"$rows_left_out":40}
{"sheet":"Proyeccion Cuotas","index":2,"n_rows":316,"n_cols":13,"rows_kept":316,"cut":false,"hidden":false,"merged":[[11,3,11,12],[12,3,13,12],[4,0,4,4],[6,5,6,6],[1,11,1,12],[1,8,1,10],[6,0,6,4],[3,8,3,10],[3,11,3,12],[0,0,0,4],[2,0,2,4],[0,5,0,6],[2,5,2,6],[4,5,4,6]]}
["Monto Solicitado:",null,null,null,null,{"$f":"+'Ingreso de Datos'!D5","v":100000}]
[null,null,null,null,null,null,null,null,"Interés Aprox. Por Pagar:",null,null,{"$f":"+SUM('Proyeccion Cuotas'!$J$16:$J$316)","v":12177.634703196354}]
["Plazo Solicitado:",null,null,null,null,{"$f":"+'Ingreso de Datos'!D7","v":36}]
[null,null,null,null,null,null,null,null,"Total Estimado a Pagar:",null,null,{"$f":"+F1+L2","v":112177.63470319635}]
["Tasa de Interés:",null,null,null,null,{"$f":"+'Ingreso de Datos'!D11","v":7.0999999999999994E-2}]
[]
["Fecha Desembolso:",null,null,null,null,{"$f":"+'Ingreso de Datos'!H3","v":"00:00:00"}]
[]
[]
[]
[]
[null,null,null,"CUOTA SOBRE SALDOS"]
[null,null,null,"NOTA: Montos pueden variar por abonos extraordinarios a capital, así mismo  tasa de interes puede variar según condiciones de mercado. "]
[]
[null,null,null,"No. Cuota","año","mes","dia","Fecha Pago","Capital ","Intereses","Dias Interes","Cuota Mensual","Saldo al Dia"]
[1,31,null,0,{"$f":"IF('Proyeccion Cuotas'!$H16=\"\",\"\",IF('Proyeccion Cuotas'!$F16=12,(YEAR('Proyeccion Cuotas'!$H16)),YEAR('Proyeccion Cuotas'!$H16)))","v":2025},{"$f":"IF('Proyeccion Cuotas'!$H16=\"\",\"\",MONTH('Proyeccion Cuotas'!$H16))","v":1},{"$f":"+IF('Proyeccion Cuotas'!$D16=\"\",\"\",VLOOKUP('Proyeccion Cuotas'!$F16,$A$16:$B$27,2,FALSE))","v":31},{"$f":"+$B$39","v":"31/1/2025"},0,{"$f":"+(($F$1*$F$5)/365)*'Proyeccion Cuotas'!$K16","v":544.65753424657532},{"$f":"'Proyeccion Cuotas'!$H16-B29","v":28},{"$f":"+SUM(I16,J16)","v":544.65753424657532},{"$f":"+F1","v":100000}]
[2,28,null,1,{"$f":"IF('Proyeccion Cuotas'!$D17=\"\",\"\",IF(F16=12,E16+1,E16))","v":2025},{"$f":"IF('Proyeccion Cuotas'!$D17=\"\",\"\",IF(G16<=3,F16,IF(F16=12,1,F16+1)))","v":2},{"$f":"+IF('Proyeccion Cuotas'!$D17=\"\",\"\",VLOOKUP('Proyeccion Cuotas'!$F17,$A$16:$B$27,2,FALSE))","v":28},{"$f":"IF('Proyeccion Cuotas'!$D17=\"\",\"\",$B$34)","v":"28/2/2025"},{"$f":"IFERROR(IF('Proyeccion Cuotas'!$D17=\"\",\"\",IF(OR('Proyeccion Cuotas'!$F17=7,'Proyeccion Cuotas'!$F17=12),($B$45+(($F$1-$B$47)/$F$3)),(($F$1-$B$47)/$F$3))),0)","v":1111.1111111111111},{"$f":"IFERROR(IF('Proyeccion Cuotas'!$D17=\"\",\"\",($F$1*$F$5*'Proyeccion Cuotas'!$K17/365)),\"\")","v":544.65753424657521},{"$f":"+IF('Proyeccion Cuotas'!$D17=\"\",\"\",'Proyeccion Cuotas'!$H17-H16)","v":28},{"$f":"IFERROR('Proyeccion Cuotas'!$I17+'Proyeccion Cuotas'!$J17,\"\")","v":1655.7686453576862},{"$f":"+IFERROR((M16-'Proyeccion Cuotas'!$I17),\"\")","v":98888.888888888891}]
[3,31,null,{"$f":"IFERROR(IF(M17<0.001,\"\",(D17+1)),\"\")","v":2},{"$f":"IF('Proyeccion Cuotas'!$D18=\"\",\"\",IF(F17=12,E17+1,E17))","v":2025},{"$f":"IF('Proyeccion Cuotas'!$D18=\"\",\"\",IF(F17=12,1,F17+1))","v":3},{"$f":"+IF('Proyeccion Cuotas'!$D18=\"\",\"\",VLOOKUP('Proyeccion Cuotas'!$F18,$A$16:$B$27,2,FALSE))","v":31},{"$f":"IF('Proyeccion Cuotas'!$D18=\"\",\"\",CONCATENATE('Proyeccion Cuotas'!$G18,\"/\",'Proyeccion Cuotas'!$F18,\"/\",'Proyeccion Cuotas'!$E18))","v":"31/3/2025"},{"$f":"IFERROR(IF('Proyeccion Cuotas'!$D18=\"\",\"\",IF(OR('Proyeccion Cuotas'!$F18=7,'Proyeccion Cuotas'!$F18=12),($B$45+(($F$1-$B$47)/$F$3)),(($F$1-$B$47)/$F$3))),0)","v":1111.1111111111111},{"$f":"IFERROR(IF('Proyeccion Cuotas'!$D18=\"\",\"\",(M17*$F$5*'Proyeccion Cuotas'!$K18/365)),\"\")","v":596.31354642313534},{"$f":"+IF('Proyeccion Cuotas'!$D18=\"\",\"\",'Proyeccion Cuotas'!$H18-H17)","v":31},{"$f":"IFERROR('Proyeccion Cuotas'!$I18+'Proyeccion Cuotas'!$J18,\"\")","v":1707.4246575342463},{"$f":"+IFERROR((M17-'Proyeccion Cuotas'!$I18),\"\")","v":97777.777777777781}]
[4,30,null,3,{"$f":"IF('Proyeccion Cuotas'!$D19=\"\",\"\",IF(F18=12,E18+1,E18))","v":2025},{"$f":"IF('Proyeccion Cuotas'!$D19=\"\",\"\",IF(F18=12,1,F18+1))","v":4},{"$f":"+IF('Proyeccion Cuotas'!$D19=\"\",\"\",VLOOKUP('Proyeccion Cuotas'!$F19,$A$16:$B$27,2,FALSE))","v":30},{"$f":"IF('Proyeccion Cuotas'!$D19=\"\",\"\",CONCATENATE('Proyeccion Cuotas'!$G19,\"/\",'Proyeccion Cuotas'!$F19,\"/\",'Proyeccion Cuotas'!$E19))","v":"30/4/2025"},{"$f":"IFERROR(IF('Proyeccion Cuotas'!$D19=\"\",\"\",IF(OR('Proyeccion Cuotas'!$F19=7,'Proyeccion Cuotas'!$F19=12),($B$45+(($F$1-$B$47)/$F$3)),(($F$1-$B$47)/$F$3))),0)","v":1111.1111111111111},{"$f":"IFERROR(IF('Proyeccion Cuotas'!$D19=\"\",\"\",(M18*$F$5*'Proyeccion Cuotas'!$K19/365)),\"\")","v":570.59360730593608},{"$f":"+IF('Proyeccion Cuotas'!$D19=\"\",\"\",'Proyeccion Cuotas'!$H19-H18)","v":30},{"$f":"IFERROR('Proyeccion Cuotas'!$I19+'Proyeccion Cuotas'!$J19,\"\")","v":1681.7047184170472},{"$f":"+IFERROR((M18-'Proyeccion Cuotas'!$I19),\"\")","v":96666.666666666672}]
[5,31,null,4,{"$f":"IF('Proyeccion Cuotas'!$D20=\"\",\"\",IF(F19=12,E19+1,E19))","v":2025},{"$f":"IF('Proyeccion Cuotas'!$D20=\"\",\"\",IF(F19=12,1,F19+1))","v":5},{"$f":"+IF('Proyeccion Cuotas'!$D20=\"\",\"\",VLOOKUP('Proyeccion Cuotas'!$F20,$A$16:$B$27,2,FALSE))","v":31},{"$f":"IF('Proyeccion Cuotas'!$D20=\"\",\"\",CONCATENATE('Proyeccion Cuotas'!$G20,\"/\",'Proyeccion Cuotas'!$F20,\"/\",'Proyeccion Cuotas'!$E20))","v":"31/5/2025"},{"$f":"IFERROR(IF('Proyeccion Cuotas'!$D20=\"\",\"\",IF(OR('Proyeccion Cuotas'!$F20=7,'Proyeccion Cuotas'!$F20=12),($B$45+(($F$1-$B$47)/$F$3)),(($F$1-$B$47)/$F$3))),0)","v":1111.1111111111111},{"$f":"IFERROR(IF('Proyeccion Cuotas'!$D20=\"\",\"\",(M19*$F$5*'Proyeccion Cuotas'!$K20/365)),\"\")","v":582.91324200913232},{"$f":"+IF('Proyeccion Cuotas'!$D20=\"\",\"\",'Proyeccion Cuotas'!$H20-H19)","v":31},{"$f":"IFERROR('Proyeccion Cuotas'!$I20+'Proyeccion Cuotas'!$J20,\"\")","v":1694.0243531202434},{"$f":"+IFERROR((M19-'Proyeccion Cuotas'!$I20),\"\")","v":95555.555555555562}]
[6,30,null,5,{"$f":"IF('Proyeccion Cuotas'!$D21=\"\",\"\",IF(F20=12,E20+1,E20))","v":2025},{"$f":"IF('Proyeccion Cuotas'!$D21=\"\",\"\",IF(F20=12,1,F20+1))","v":6},{"$f":"+IF('Proyeccion Cuotas'!$D21=\"\",\"\",VLOOKUP('Proyeccion Cuotas'!$F21,$A$16:$B$27,2,FALSE))","v":30},{"$f":"IF('Proyeccion Cuotas'!$D21=\"\",\"\",CONCATENATE('Proyeccion Cuotas'!$G21,\"/\",'Proyeccion Cuotas'!$F21,\"/\",'Proyeccion Cuotas'!$E21))","v":"30/6/2025"},{"$f":"IFERROR(IF('Proyeccion Cuotas'!$D21=\"\",\"\",IF(OR('Proyeccion Cuotas'!$F21=7,'Proyeccion Cuotas'!$F21=12),($B$45+(($F$1-$B$47)/$F$3)),(($F$1-$B$47)/$F$3))),0)","v":1111.1111111111111},{"$f":"IFERROR(IF('Proyeccion Cuotas'!$D21=\"\",\"\",(M20*$F$5*'Proyeccion Cuotas'!$K21/365)),\"\")","v":557.6255707762557},{"$f":"+IF('Proyeccion Cuotas'!$D21=\"\",\"\",'Proyeccion Cuotas'!$H21-H20)","v":30},{"$f":"IFERROR('Proyeccion Cuotas'!$I21+'Proyeccion Cuotas'!$J21,\"\")","v":1668.7366818873668},{"$f":"+IFERROR((M20-'Proyeccion Cuotas'!$I21),\"\")","v":94444.444444444453}]
[7,31,null,6,{"$f":"IF('Proyeccion Cuotas'!$D22=\"\",\"\",IF(F21=12,E21+1,E21))","v":2025},{"$f":"IF('Proyeccion Cuotas'!$D22=\"\",\"\",IF(F21=12,1,F21+1))","v":7},{"$f":"+IF('Proyeccion Cuotas'!$D22=\"\",\"\",VLOOKUP('Proyeccion Cuotas'!$F22,$A$16:$B$27,2,FALSE))","v":31},{"$f":"IF('Proyeccion Cuotas'!$D22=\"\",\"\",CONCATENATE('Proyeccion Cuotas'!$G22,\"/\",'Proyeccion Cuotas'!$F22,\"/\",'Proyeccion Cuotas'!$E22))","v":"31/7/2025"},{"$f":"IFERROR(IF('Proyeccion Cuotas'!$D22=\"\",\"\",IF(OR('Proyeccion Cuotas'!$F22=7,'Proyeccion Cuotas'!$F22=12),($B$45+(($F$1-$B$47)/$F$3)),(($F$1-$B$47)/$F$3))),0)","v":11111.111111111111},{"$f":"IFERROR(IF('Proyeccion Cuotas'!$D22=\"\",\"\",(M21*$F$5*'Proyeccion Cuotas'!$K22/365)),\"\")","v":569.51293759512942},{"$f":"+IF('Proyeccion Cuotas'!$D22=\"\",\"\",'Proyeccion Cuotas'!$H22-H21)","v":31},{"$f":"IFERROR('Proyeccion Cuotas'!$I22+'Proyeccion Cuotas'!$J22,\"\")","v":11680.624048706241},{"$f":"+IFERROR((M21-'Proyeccion Cuotas'!$I22),\"\")","v":83333.333333333343}]
[8,31,null,7,{"$f":"IF('Proyeccion Cuotas'!$D23=\"\",\"\",IF(F22=12,E22+1,E22))","v":2025},{"$f":"IF('Proyeccion Cuotas'!$D23=\"\",\"\",IF(F22=12,1,F22+1))","v":8},{"$f":"+IF('Proyeccion Cuotas'!$D23=\"\",\"\",VLOOKUP('Proyeccion Cuotas'!$F23,$A$16:$B$27,2,FALSE))","v":31},{"$f":"IF('Proyeccion Cuotas'!$D23=\"\",\"\",CONCATENATE('Proyeccion Cuotas'!$G23,\"/\",'Proyeccion Cuotas'!$F23,\"/\",'Proyeccion Cuotas'!$E23))","v":"31/8/2025"},{"$f":"IFERROR(IF('Proyeccion Cuotas'!$D23=\"\",\"\",IF(OR('Proyeccion Cuotas'!$F23=7,'Proyeccion Cuotas'!$F23=12),($B$45+(($F$1-$B$47)/$F$3)),(($F$1-$B$47)/$F$3))),0)","v":1111.1111111111111},{"$f":"IFERROR(IF('Proyeccion Cuotas'!$D23=\"\",\"\",(M22*$F$5*'Proyeccion Cuotas'!$K23/365)),\"\")","v":502.51141552511422},{"$f":"+IF('Proyeccion Cuotas'!$D23=\"\",\"\",'Proyeccion Cuotas'!$H23-H22)","v":31},{"$f":"IFERROR('Proyeccion Cuotas'!$I23+'Proyeccion Cuotas'!$J23,\"\")","v":1613.6225266362253},{"$f":"+IFERROR((M22-'Proyeccion Cuotas'!$I23),\"\")","v":82222.222222222234}]
[9,30,null,8,{"$f":"IF('Proyeccion Cuotas'!$D24=\"\",\"\",IF(F23=12,E23+1,E23))","v":2025},{"$f":"IF('Proyeccion Cuotas'!$D24=\"\",\"\",IF(F23=12,1,F23+1))","v":9},{"$f":"+IF('Proyeccion Cuotas'!$D24=\"\",\"\",VLOOKUP('Proyeccion Cuotas'!$F24,$A$16:$B$27,2,FALSE))","v":30},{"$f":"IF('Proyeccion Cuotas'!$D24=\"\",\"\",CONCATENATE('Proyeccion Cuotas'!$G24,\"/\",'Proyeccion Cuotas'!$F24,\"/\",'Proyeccion Cuotas'!$E24))","v":"30/9/2025"},{"$f":"IFERROR(IF('Proyeccion Cuotas'!$D24=\"\",\"\",IF(OR('Proyeccion Cuotas'!$F24=7,'Proyeccion Cuotas'!$F24=12),($B$45+(($F$1-$B$47)/$F$3)),(($F$1-$B$47)/$F$3))),0)","v":1111.1111111111111},{"$f":"IFERROR(IF('Proyeccion Cuotas'!$D24=\"\",\"\",(M23*$F$5*'Proyeccion Cuotas'!$K24/365)),\"\")","v":479.81735159817356},{"$f":"+IF('Proyeccion Cuotas'!$D24=\"\",\"\",'Proyeccion Cuotas'!$H24-H23)","v":30},{"$f":"IFERROR('Proyeccion Cuotas'!$I24+'Proyeccion Cuotas'!$J24,\"\")","v":1590.9284627092848},{"$f":"+IFERROR((M23-'Proyeccion Cuotas'!$I24),\"\")","v":81111.111111111124}]
[10,31,null,9,{"$f":"IF('Proyeccion Cuotas'!$D25=\"\",\"\",IF(F24=12,E24+1,E24))","v":2025},{"$f":"IF('Proyeccion Cuotas'!$D25=\"\",\"\",IF(F24=12,1,F24+1))","v":10},{"$f":"+IF('Proyeccion Cuotas'!$D25=\"\",\"\",VLOOKUP('Proyeccion Cuotas'!$F25,$A$16:$B$27,2,FALSE))","v":31},{"$f":"IF('Proyeccion Cuotas'!$D25=\"\",\"\",CONCATENATE('Proyeccion Cuotas'!$G25,\"/\",'Proyeccion Cuotas'!$F25,\"/\",'Proyeccion Cuotas'!$E25))","v":"31/10/2025"},{"$f":"IFERROR(IF('Proyeccion Cuotas'!$D25=\"\",\"\",IF(OR('Proyeccion Cuotas'!$F25=7,'Proyeccion Cuotas'!$F25=12),($B$45+(($F$1-$B$47)/$F$3)),(($F$1-$B$47)/$F$3))),0)","v":1111.1111111111111},{"$f":"IFERROR(IF('Proyeccion Cuotas'!$D25=\"\",\"\",(M24*$F$5*'Proyeccion Cuotas'!$K25/365)),\"\")","v":489.1111111111112},{"$f":"+IF('Proyeccion Cuotas'!$D25=\"\",\"\",'Proyeccion Cuotas'!$H25-H24)","v":31},{"$f":"IFERROR('Proyeccion Cuotas'!$I25+'Proyeccion Cuotas'!$J25,\"\")","v":1600.2222222222222},{"$f":"+IFERROR((M24-'Proyeccion Cuotas'!$I25),\"\")","v":80000.000000000015}]
[11,30,null,10,{"$f":"IF('Proyeccion Cuotas'!$D26=\"\",\"\",IF(F25=12,E25+1,E25))","v":2025},{"$f":"IF('Proyeccion Cuotas'!$D26=\"\",\"\",IF(F25=12,1,F25+1))","v":11},{"$f":"+IF('Proyeccion Cuotas'!$D26=\"\",\"\",VLOOKUP('Proyeccion Cuotas'!$F26,$A$16:$B$27,2,FALSE))","v":30},{"$f":"IF('Proyeccion Cuotas'!$D26=\"\",\"\",CONCATENATE('Proyeccion Cuotas'!$G26,\"/\",'Proyeccion Cuotas'!$F26,\"/\",'Proyeccion Cuotas'!$E26))","v":"30/11/2025"},{"$f":"IFERROR(IF('Proyeccion Cuotas'!$D26=\"\",\"\",IF(OR('Proyeccion Cuotas'!$F26=7,'Proyeccion Cuotas'!$F26=12),($B$45+(($F$1-$B$47)/$F$3)),(($F$1-$B$47)/$F$3))),0)","v":1111.1111111111111},{"$f":"IFERROR(IF('Proyeccion Cuotas'!$D26=\"\",\"\",(M25*$F$5*'Proyeccion Cuotas'!$K26/365)),\"\")","v":466.84931506849324},{"$f":"+IF('Proyeccion Cuotas'!$D26=\"\",\"\",'Proyeccion Cuotas'!$H26-H25)","v":30},{"$f":"IFERROR('Proyeccion Cuotas'!$I26+'Proyeccion Cuotas'!$J26,\"\")","v":1577.9604261796044},{"$f":"+IFERROR((M25-'Proyeccion Cuotas'!$I26),\"\")","v":78888.888888888905}]
[12,31,null,11,{"$f":"IF('Proyeccion Cuotas'!$D27=\"\",\"\",IF(F26=12,E26+1,E26))","v":2025},{"$f":"IF('Proyeccion Cuotas'!$D27=\"\",\"\",IF(F26=12,1,F26+1))","v":12},{"$f":"+IF('Proyeccion Cuotas'!$D27=\"\",\"\",VLOOKUP('Proyeccion Cuotas'!$F27,$A$16:$B$27,2,FALSE))","v":31},{"$f":"IF('Proyeccion Cuotas'!$D27=\"\",\"\",CONCATENATE('Proyeccion Cuotas'!$G27,\"/\",'Proyeccion Cuotas'!$F27,\"/\",'Proyeccion Cuotas'!$E27))","v":"31/12/2025"},{"$f":"IFERROR(IF('Proyeccion Cuotas'!$D27=\"\",\"\",IF(OR('Proyeccion Cuotas'!$F27=7,'Proyeccion Cuotas'!$F27=12),($B$45+(($F$1-$B$47)/$F$3)),(($F$1-$B$47)/$F$3))),0)","v":11111.111111111111},{"$f":"IFERROR(IF('Proyeccion Cuotas'!$D27=\"\",\"\",(M26*$F$5*'Proyeccion Cuotas'!$K27/365)),\"\")","v":475.71080669710807},{"$f":"+IF('Proyeccion Cuotas'!$D27=\"\",\"\",'Proyeccion Cuotas'!$H27-H26)","v":31},{"$f":"IFERROR('Proyeccion Cuotas'!$I27+'Proyeccion Cuotas'!$J27,\"\")","v":11586.82191780822},{"$f":"+IFERROR((M26-'Proyeccion Cuotas'!$I27),\"\")","v":67777.777777777796}]
[null,null,null,12,{"$f":"IF('Proyeccion Cuotas'!$D28=\"\",\"\",IF(F27=12,E27+1,E27))","v":2026},{"$f":"IF('Proyeccion Cuotas'!$D28=\"\",\"\",IF(F27=12,1,F27+1))","v":1},{"$f":"+IF('Proyeccion Cuotas'!$D28=\"\",\"\",VLOOKUP('Proyeccion Cuotas'!$F28,$A$16:$B$27,2,FALSE))","v":31},{"$f":"IF('Proyeccion Cuotas'!$D28=\"\",\"\",CONCATENATE('Proyeccion Cuotas'!$G28,\"/\",'Proyeccion Cuotas'!$F28,\"/\",'Proyeccion Cuotas'!$E28))","v":"31/1/2026"},{"$f":"IFERROR(IF('Proyeccion Cuotas'!$D28=\"\",\"\",IF(OR('Proyeccion Cuotas'!$F28=7,'Proyeccion Cuotas'!$F28=12),($B$45+(($F$1-$B$47)/$F$3)),(($F$1-$B$47)/$F$3))),0)","v":1111.1111111111111},{"$f":"IFERROR(IF('Proyeccion Cuotas'!$D28=\"\",\"\",(M27*$F$5*'Proyeccion Cuotas'!$K28/365)),\"\")","v":408.70928462709287},{"$f":"+IF('Proyeccion Cuotas'!$D28=\"\",\"\",'Proyeccion Cuotas'!$H28-H27)","v":31},{"$f":"IFERROR('Proyeccion Cuotas'!$I28+'Proyeccion Cuotas'!$J28,\"\")","v":1519.8203957382038},{"$f":"+IFERROR((M27-'Proyeccion Cuotas'!$I28),\"\")","v":66666.666666666686}]
["fhoy",{"$f":"+IF(OR(F7=\"\",F7=0),TODAY(),F7)","v":"2025-01-03"},null,13,{"$f":"IF('Proyeccion Cuotas'!$D29=\"\",\"\",IF(F28=12,E28+1,E28))","v":2026},{"$f":"IF('Proyeccion Cuotas'!$D29=\"\",\"\",IF(F28=12,1,F28+1))","v":2},{"$f":"+IF('Proyeccion Cuotas'!$D29=\"\",\"\",VLOOKUP('Proyeccion Cuotas'!$F29,$A$16:$B$27,2,FALSE))","v":28},{"$f":"IF('Proyeccion Cuotas'!$D29=\"\",\"\",CONCATENATE('Proyeccion Cuotas'!$G29,\"/\",'Proyeccion Cuotas'!$F29,\"/\",'Proyeccion Cuotas'!$E29))","v":"28/2/2026"},{"$f":"IFERROR(IF('Proyeccion Cuotas'!$D29=\"\",\"\",IF(OR('Proyeccion Cuotas'!$F29=7,'Proyeccion Cuotas'!$F29=12),($B$45+(($F$1-$B$47)/$F$3)),(($F$1-$B$47)/$F$3))),0)","v":1111.1111111111111},{"$f":"IFERROR(IF('Proyeccion Cuotas'!$D29=\"\",\"\",(M28*$F$5*'Proyeccion Cuotas'!$K29/365)),\"\")","v":363.10502283105023},{"$f":"+IF('Proyeccion Cuotas'!$D29=\"\",\"\",'Proyeccion Cuotas'!$H29-H28)","v":28},{"$f":"IFERROR('Proyeccion Cuotas'!$I29+'Proyeccion Cuotas'!$J29,\"\")","v":1474.2161339421614},{"$f":"+IFERROR((M28-'Proyeccion Cuotas'!$I29),\"\")","v":65555.555555555577}]
["mes",{"$f":"+MONTH(B29)","v":1},null,14,{"$f":"IF('Proyeccion Cuotas'!$D30=\"\",\"\",IF(F29=12,E29+1,E29))","v":2026},{"$f":"IF('Proyeccion Cuotas'!$D30=\"\",\"\",IF(F29=12,1,F29+1))","v":3},{"$f":"+IF('Proyeccion Cuotas'!$D30=\"\",\"\",VLOOKUP('Proyeccion Cuotas'!$F30,$A$16:$B$27,2,FALSE))","v":31},{"$f":"IF('Proyeccion Cuotas'!$D30=\"\",\"\",CONCATENATE('Proyeccion Cuotas'!$G30,\"/\",'Proyeccion Cuotas'!$F30,\"/\",'Proyeccion Cuotas'!$E30))","v":"31/3/2026"},{"$f":"IFERROR(IF('Proyeccion Cuotas'!$D30=\"\",\"\",IF(OR('Proyeccion Cuotas'!$F30=7,'Proyeccion Cuotas'!$F30=12),($B$45+(($F$1-$B$47)/$F$3)),(($F$1-$B$47)/$F$3))),0)","v":1111.1111111111111},{"$f":"IFERROR(IF('Proyeccion Cuotas'!$D30=\"\",\"\",(M29*$F$5*'Proyeccion Cuotas'!$K30/365)),\"\")","v":395.30898021308991},{"$f":"+IF('Proyeccion Cuotas'!$D30=\"\",\"\",'Proyeccion Cuotas'!$H30-H29)","v":31},{"$f":"IFERROR('Proyeccion Cuotas'!$I30+'Proyeccion Cuotas'!$J30,\"\")","v":1506.4200913242009},{"$f":"+IFERROR((M29-'Proyeccion Cuotas'!$I30),\"\")","v":64444.444444444467}]
{"$rows_left_out":286}